Reaction Details
TargetC-C chemokine receptor type 5
LigandBDBM50121828
Substrate/Competitorn/a
Meas. Tech.ChEMBL_500129 (CHEMBL974332)
IC50 0.2±n/a nM
Citation Zhuo, YKong, RCong, XJChen, WZWang, CX Three-dimensional QSAR analyses of 1,3,4-trisubstituted pyrrolidine-based CCR5 receptor inhibitors. Eur J Med Chem43:2724-34 (2008) 
 
C-C chemokine receptor type 5
Name:C-C chemokine receptor type 5
Type:Enzyme
Mol. Mass.:40540.21
Organism:Homo sapiens (Human)
Description:P51681
Residue:352
BDBM50121828
NameBDBM50121828
Synonyms:(R)-3-Cyclobutyl-2-((S)-3-(3-fluoro-phenyl)-4-{4-[3-(4-trifluoromethyl-phenyl)-propyl]-piperidin-1-ylmethyl}-pyrrolidin-1-yl)-propionic acid CHEMBL21147
TypeSmall organic molecule
Emp. Form.C33H42F4N2O2
Mol. Mass.574.6924
SMILESOC(=O)[C@@H](CC1CCC1)N1C[C@H](CN2CCC(CCCc3ccc(cc3)C(F)(F)F)CC2)[C@H](C1)c1cccc(F)c1