Reaction Details
TargetIntegrin alpha-4
LigandBDBM50243737
Substrate/Competitorn/a
Meas. Tech.ChEMBL_492185 (CHEMBL951561)
IC50 2±n/a nM
Citation Phillips, DJDavenport, RJDemaude, TAGalleway, FPJones, MWKnerr, LPerry, BGRatcliffe, AJ Imidazopyridines as VLA-4 integrin antagonists. Bioorg Med Chem Lett18:4146-9 (2008) 
 
Integrin alpha-4
Name:Integrin alpha-4
Type:Membrane Protein
Mol. Mass.:114897.35
Organism:Homo sapiens (Human)
Description:P13612
Residue:1032
BDBM50243737
NameBDBM50243737
Synonyms:(S)-2-(2-Isopropylsulfanyl-3-oxo-spiro[3.5]non-1-en-1-ylamino)-3-[4-(2-pyridin-3-yl-imidazo[4,5-b]pyridin-3-yl)-phenyl]-propionic acid | CHEMBL507508
TypeSmall organic molecule
Emp. Form.C32H33N5O3S
Mol. Mass.567.701
SMILESCC(C)SC1=C(N[C@@H](Cc2ccc(cc2)-n2c(nc3cccnc23)-c2cccnc2)C(O)=O)C2(CCCCC2)C1=O