Reaction Details
TargetIntegrin alpha-4
LigandBDBM50243751
Substrate/Competitorn/a
Meas. Tech.ChEMBL_492185 (CHEMBL951561)
IC50 71±n/a nM
Citation Phillips, DJDavenport, RJDemaude, TAGalleway, FPJones, MWKnerr, LPerry, BGRatcliffe, AJ Imidazopyridines as VLA-4 integrin antagonists. Bioorg Med Chem Lett18:4146-9 (2008) 
 
Integrin alpha-4
Name:Integrin alpha-4
Type:Membrane Protein
Mol. Mass.:114897.35
Organism:Homo sapiens (Human)
Description:P13612
Residue:1032
BDBM50243751
NameBDBM50243751
Synonyms:(S)-2-(2-Bromo-3-oxo-spiro[3.5]non-1-en-1-ylamino)-3-[4-(2-phenyl-imidazo[4,5-b]pyridin-3-yl)-phenyl]-propionic acid | CHEMBL516592
TypeSmall organic molecule
Emp. Form.C30H27BrN4O3
Mol. Mass.571.464
SMILESOC(=O)[C@H](Cc1ccc(cc1)-n1c(nc2cccnc12)-c1ccccc1)NC1=C(Br)C(=O)C11CCCCC1