Reaction Details
TargetIntegrin alpha-4
LigandBDBM50243748
Substrate/Competitorn/a
Meas. Tech.ChEMBL_492185 (CHEMBL951561)
IC50 95±n/a nM
Citation Phillips, DJDavenport, RJDemaude, TAGalleway, FPJones, MWKnerr, LPerry, BGRatcliffe, AJ Imidazopyridines as VLA-4 integrin antagonists. Bioorg Med Chem Lett18:4146-9 (2008) 
 
Integrin alpha-4
Name:Integrin alpha-4
Type:Membrane Protein
Mol. Mass.:114897.35
Organism:Homo sapiens (Human)
Description:P13612
Residue:1032
BDBM50243748
NameBDBM50243748
Synonyms:(S)-2-(2-Bromo-3-oxo-spiro[3.5]non-1-en-1-ylamino)-3-[4-(2-cyclopropyl-imidazo[4,5-b]pyridin-3-yl)-phenyl]-propionic acid | CHEMBL469692
TypeSmall organic molecule
Emp. Form.C27H27BrN4O3
Mol. Mass.535.432
SMILESOC(=O)[C@H](Cc1ccc(cc1)-n1c(nc2cccnc12)C1CC1)NC1=C(Br)C(=O)C11CCCCC1