Reaction Details
TargetCalmodulin-sensitive adenylate cyclase
LigandBDBM50243829
Substrate/Competitorn/a
Meas. Tech.ChEMBL_492206 (CHEMBL951582)
IC50>100000±n/a nM
Citation Jimenez, MEBush, KPawlik, JSower, LPeterson, JWGilbertson, SR Synthesis and screening of small molecule inhibitors of anthrax edema factor. Bioorg Med Chem Lett18:4215-8 (2008) 
 
Calmodulin-sensitive adenylate cyclase
Name:Calmodulin-sensitive adenylate cyclase
Type:PROTEIN
Mol. Mass.:92481.33
Organism:Bacillus anthracis
Description:ChEMBL_606615
Residue:800
BDBM50243829
NameBDBM50243829
Synonyms:3-(thiophen-2-yl)cyclohex-2-enone | CHEMBL451060
TypeSmall organic molecule
Emp. Form.C10H10OS
Mol. Mass.178.251
SMILESO=C1CCCC(=C1)c1cccs1