Reaction Details
TargetSubstance-P receptor
LigandBDBM50243376
Substrate/Competitorn/a
Meas. Tech.ChEMBL_491574 (CHEMBL944220)
Ki 0.3±n/a nM
Citation Paliwal, SReichard, GAShah, SWrobleski, MLWang, CStengone, CTsui, HCXiao, DDuffy, RALachowicz, JENomeir, AAVarty, GBShih, NY Discovery of a novel, potent and orally active series of gamma-lactams as selective NK1 antagonists. Bioorg Med Chem Lett18:4168-71 (2008) 
 
Substance-P receptor
Name:Substance-P receptor
Type:G Protein-Coupled Receptor (GPCR)
Mol. Mass.:46254.43
Organism:Homo sapiens (Human)
Description:P25103
Residue:407
BDBM50243376
NameBDBM50243376
Synonyms:CHEMBL452532 | N-((3R,5S)-5-(((R)-1-(3,5-bis(trifluoromethyl)phenyl)ethoxy)methyl)-2-oxo-5-phenylpyrrolidin-3-yl)propionamide
TypeSmall organic molecule
Emp. Form.C24H24F6N2O3
Mol. Mass.502.4494
SMILESCCC(=O)N[C@@H]1C[C@](CO[C@H](C)c2cc(cc(c2)C(F)(F)F)C(F)(F)F)(NC1=O)c1ccccc1