Reaction Details
TargetBeta-2 adrenergic receptor
LigandBDBM50243113
Substrate/Competitorn/a
Meas. Tech.ChEMBL_492277 (CHEMBL947245)
EC50 3200±n/a nM
Citation Imanishi, MItou, SWashizuka, KHamashima, HNakajima, YAraki, TTomishima, YSakurai, MMatsui, SImamura, EUeshima, KYamamoto, TYamamoto, NIshikawa, HNakano, KUnami, NHamada, KMatsumura, YTakamura, FHattori, K Discovery of a novel series of biphenyl benzoic acid derivatives as highly potent and selective human beta3 adrenergic receptor agonists with good oral bioavailability. Part II. J Med Chem51:4002-20 (2008) 
 
Beta-2 adrenergic receptor
Name:Beta-2 adrenergic receptor
Type:n/a
Mol. Mass.:46461.69
Organism:Homo sapiens (Human)
Description:P07550
Residue:413
BDBM50243113
NameBDBM50243113
Synonyms:4-(2-{[(2R)-2-(6-Amino-3-pyridinyl)-2-hydroxyethyl]amino}ethyl)-3-isobutyl-4-biphenylcarboxylic acid | CHEMBL487682
TypeSmall organic molecule
Emp. Form.C26H31N3O3
Mol. Mass.433.5426
SMILESCC(C)Cc1cc(ccc1C(O)=O)-c1ccc(CCNC[C@H](O)c2ccc(N)nc2)cc1