Reaction Details
TargetBeta-2 adrenergic receptor
LigandBDBM50243167
Substrate/Competitorn/a
Meas. Tech.ChEMBL_492277 (CHEMBL947245)
EC50 1100±n/a nM
Citation Imanishi, MItou, SWashizuka, KHamashima, HNakajima, YAraki, TTomishima, YSakurai, MMatsui, SImamura, EUeshima, KYamamoto, TYamamoto, NIshikawa, HNakano, KUnami, NHamada, KMatsumura, YTakamura, FHattori, K Discovery of a novel series of biphenyl benzoic acid derivatives as highly potent and selective human beta3 adrenergic receptor agonists with good oral bioavailability. Part II. J Med Chem51:4002-20 (2008) 
 
Beta-2 adrenergic receptor
Name:Beta-2 adrenergic receptor
Type:n/a
Mol. Mass.:46461.69
Organism:Homo sapiens (Human)
Description:P07550
Residue:413
BDBM50243167
NameBDBM50243167
Synonyms:4-(2-{[(2R)-2-(6-Amino-3-pyridinyl)-2-hydroxyethyl]amino}ethyl)-3-(cyclohexyloxy)-4-biphenylcarboxylic acid | CHEMBL529659
TypeSmall organic molecule
Emp. Form.C28H33N3O4
Mol. Mass.475.5793
SMILESNc1ccc(cn1)[C@@H](O)CNCCc1ccc(cc1)-c1ccc(C(O)=O)c(OC2CCCCC2)c1