Reaction Details
TargetDipeptidyl peptidase 4
LigandBDBM50243687
Substrate/Competitorn/a
Meas. Tech.ChEMBL_492003 (CHEMBL938686)
IC50 530±n/a nM
Citation Van der Veken, PDe Meester, IDubois, VSoroka, AVan Goethem, SMaes, MBBrandt, ILambeir, AMChen, XHaemers, AScharpé, SAugustyns, K Inhibitors of dipeptidyl peptidase 8 and dipeptidyl peptidase 9. Part 1: identification of dipeptide derived leads. Bioorg Med Chem Lett18:4154-8 (2008) 
 
Dipeptidyl peptidase 4
Name:Dipeptidyl peptidase 4
Type:Enzyme
Mol. Mass.:88271.01
Organism:Homo sapiens (Human)
Description:P27487
Residue:766
BDBM50243687
NameBDBM50243687
Synonyms:CHEMBL471747 | benzyl (S)-5-amino-6-((2S,4S)-4-azido-2-cyanopyrrolidin-1-yl)-6-oxohexylcarbamate
TypeSmall organic molecule
Emp. Form.C19H25N7O3
Mol. Mass.399.4469
SMILESN[C@@H](CCCCNC(=O)OCc1ccccc1)C(=O)N1C[C@H](C[C@H]1C#N)N=[N+]=[N-]