Reaction Details
TargetHistone deacetylase 6
LigandBDBM50252005
Substrate/Competitorn/a
Meas. Tech.ChEMBL_491722 (CHEMBL949577)
Ki 110±n/a nM
Citation Dehmel, FWeinbrenner, SJulius, HCiossek, TMaier, TStengel, TFettis, KBurkhardt, CWieland, HBeckers, T Trithiocarbonates as a novel class of HDAC inhibitors: SAR studies, isoenzyme selectivity, and pharmacological profiles. J Med Chem51:3985-4001 (2008) 
 
Histone deacetylase 6
Name:Histone deacetylase 6
Type:Chromatin regulator; hydrolase; repressor
Mol. Mass.:131381.51
Organism:Homo sapiens (Human)
Description:Q9UBN7
Residue:1215
BDBM50252005
NameBDBM50252005
Synonyms:2-(3-Benzoylamino-phenyl)-2-oxoethyl ethyl trithiocarbonate | CHEMBL479611
TypeSmall organic molecule
Emp. Form.C18H17NO2S3
Mol. Mass.375.528
SMILESCCSC(=S)SCC(=O)c1cccc(NC(=O)c2ccccc2)c1