Reaction Details
TargetDipeptidyl peptidase 4
LigandBDBM11159
Substrate/Competitorn/a
Meas. Tech.ChEMBL_490313 (CHEMBL981107)
IC50 128±n/a nM
Citation Hagmann, WK The many roles for fluorine in medicinal chemistry. J Med Chem51:4359-69 (2008) 
 
Dipeptidyl peptidase 4
Name:Dipeptidyl peptidase 4
Type:Enzyme
Mol. Mass.:88271.01
Organism:Homo sapiens (Human)
Description:P27487
Residue:766
BDBM11159
NameBDBM11159
Synonyms:(1R)-1-(3,4-difluorobenzyl)-3-oxo-3-[3-(trifluoromethyl)-5,6-dihydro[1,2,4]triazolo[4,3-a]pyrazin-7(8H)-yl]propylamine hydrochloride CHEMBL242813 | Triazolopiperazine Analogue 24
TypeSmall organic molecule
Emp. Form.C16H16F5N5O
Mol. Mass.389.3232
SMILESN[C@@H](CC(=O)N1CCn2c(C1)nnc2C(F)(F)F)Cc1ccc(F)c(F)c1