Reaction Details
TargetAndrogen receptor
LigandBDBM50252384
Substrate/Competitorn/a
Meas. Tech.ChEMBL_487546 (CHEMBL1013140)
Ki 220±n/a nM
Citation Wakabayashi, KImai, KMiyachi, HHashimoto, YTanatani, A 4-(Anilino)pyrrole-2-carboxamides: Novel non-steroidal/non-anilide type androgen antagonists effective upon human prostate tumor LNCaP cells with mutated nuclear androgen receptor. Bioorg Med Chem16:6799-812 (2008) 
 
Androgen receptor
Name:Androgen receptor
Type:Receptor
Mol. Mass.:99185.27
Organism:Homo sapiens (Human)
Description:CHO cells were stably transfected with human AR gene.
Residue:920
BDBM50252384
NameBDBM50252384
Synonyms:4-[(Benzyl)(4-nitrophenyl)amino]-1-methylpyrrole-2-carboxamide | CHEMBL480162
TypeSmall organic molecule
Emp. Form.C19H18N4O3
Mol. Mass.350.3712
SMILESCn1cc(cc1C(N)=O)N(Cc1ccccc1)c1ccc(cc1)[N+]([O-])=O