Reaction Details
TargetAndrogen receptor
LigandBDBM50252328
Substrate/Competitorn/a
Meas. Tech.ChEMBL_487546 (CHEMBL1013140)
Ki 140±n/a nM
Citation Wakabayashi, KImai, KMiyachi, HHashimoto, YTanatani, A 4-(Anilino)pyrrole-2-carboxamides: Novel non-steroidal/non-anilide type androgen antagonists effective upon human prostate tumor LNCaP cells with mutated nuclear androgen receptor. Bioorg Med Chem16:6799-812 (2008) 
 
Androgen receptor
Name:Androgen receptor
Type:Receptor
Mol. Mass.:99185.27
Organism:Homo sapiens (Human)
Description:CHO cells were stably transfected with human AR gene.
Residue:920
BDBM50252328
NameBDBM50252328
Synonyms:CHEMBL479988 | N-{4-[(4-Acetylphenyl)(benzyl)amino]-1-methylpyrrole-2-carbonyl}pyrrolidine
TypeSmall organic molecule
Emp. Form.C25H27N3O2
Mol. Mass.401.5008
SMILESCC(=O)c1ccc(cc1)N(Cc1ccccc1)c1cc(C(=O)N2CCCC2)n(C)c1