Reaction Details
TargetAndrogen receptor
LigandBDBM50252276
Substrate/Competitorn/a
Meas. Tech.ChEMBL_487546 (CHEMBL1013140)
Ki 130±n/a nM
Citation Wakabayashi, KImai, KMiyachi, HHashimoto, YTanatani, A 4-(Anilino)pyrrole-2-carboxamides: Novel non-steroidal/non-anilide type androgen antagonists effective upon human prostate tumor LNCaP cells with mutated nuclear androgen receptor. Bioorg Med Chem16:6799-812 (2008) 
 
Androgen receptor
Name:Androgen receptor
Type:Receptor
Mol. Mass.:99185.27
Organism:Homo sapiens (Human)
Description:CHO cells were stably transfected with human AR gene.
Residue:920
BDBM50252276
NameBDBM50252276
Synonyms:CHEMBL480955 | N-{4-[(Benzyl)(4-cyanophenyl)amino]-1-methylpyrrole-2-carbonyl}pyrrolidine
TypeSmall organic molecule
Emp. Form.C24H24N4O
Mol. Mass.384.4736
SMILESCn1cc(cc1C(=O)N1CCCC1)N(Cc1ccccc1)c1ccc(cc1)C#N