Reaction Details
TargetAndrogen receptor
LigandBDBM50252330
Substrate/Competitorn/a
Meas. Tech.ChEMBL_487550 (CHEMBL1013144)
IC50 950±n/a nM
Citation Wakabayashi, KImai, KMiyachi, HHashimoto, YTanatani, A 4-(Anilino)pyrrole-2-carboxamides: Novel non-steroidal/non-anilide type androgen antagonists effective upon human prostate tumor LNCaP cells with mutated nuclear androgen receptor. Bioorg Med Chem16:6799-812 (2008) 
 
Androgen receptor
Name:Androgen receptor
Type:Receptor
Mol. Mass.:99185.27
Organism:Homo sapiens (Human)
Description:CHO cells were stably transfected with human AR gene.
Residue:920
BDBM50252330
NameBDBM50252330
Synonyms:CHEMBL521251 | Ethyl 4-[(benzyl)(4-nitrophenyl)amino]-1-methylpyrrole-2-carboxylate
TypeSmall organic molecule
Emp. Form.C21H21N3O4
Mol. Mass.379.4091
SMILESCCOC(=O)c1cc(cn1C)N(Cc1ccccc1)c1ccc(cc1)[N+]([O-])=O