Reaction Details
TargetCruzipain
LigandBDBM50229129
Substrate/Competitorn/a
Meas. Tech.ChEMBL_557650 (CHEMBL961600)
IC50 4±n/a nM
Citation Chen, YTLira, RHansell, EMcKerrow, JHRoush, WR Synthesis of macrocyclic trypanosomal cysteine protease inhibitors. Bioorg Med Chem Lett18:5860-3 (2008) 
 
Cruzipain
Name:Cruzipain
Type:Protein
Mol. Mass.:49831.41
Organism:Trypanosoma cruzi
Description:P25779
Residue:467
BDBM50229129
NameBDBM50229129
Synonyms:4-Methyl-piperazine-1-carboxylic acid [(S)-1-((E)-(S)-3-benzenesulfonyl-1-phenethyl-allylcarbamoyl)-2-phenyl-ethyl]-amide 4-methyl-N-((S)-1-oxo-3-phenyl-1-((S)-5-phenyl-1-(phenylsulfonyl)pent-1-en-3-ylamino)propan-2-yl)piperazine-1-carboxamide CHEMBL91704 | K-777
TypeSmall organic molecule
Emp. Form.C32H38N4O4S
Mol. Mass.574.734
SMILESCN1CCN(CC1)C(=O)N[C@@H](Cc1ccccc1)C(=O)N[C@@H](CCc1ccccc1)C=CS(=O)(=O)c1ccccc1