Reaction Details
TargetLysine--tRNA ligase
LigandBDBM50263040
Substrate/Competitorn/a
Meas. Tech.ChEMBL_490569 (CHEMBL981176)
IC50 150±n/a nM
Citation Hirabayashi, AMukaiyama, HKobayashi, HShiohara, HNakayama, SOzawa, MMiyazawa, KMisawa, KOhnota, HIsaji, M A novel Syk family kinase inhibitor: design, synthesis, and structure-activity relationship of 1,2,4-triazolo[4,3-c]pyrimidine and 1,2,4-triazolo[1,5-c]pyrimidine derivatives. Bioorg Med Chem16:7347-57 (2008) 
 
Lysine--tRNA ligase
Name:Lysine--tRNA ligase
Type:PROTEIN
Mol. Mass.:68044.78
Organism:Homo sapiens (Human)
Description:ChEMBL_960665
Residue:597
BDBM50263040
NameBDBM50263040
Synonyms:5-(2-Amino-2-methylpropylamino)-7-(3,5-dimethoxyphenylamino)-1,2,4-triazolo[4,3-c]pyrimidine-8-carboxamide | CHEMBL476741
TypeSmall organic molecule
Emp. Form.C18H24N8O3
Mol. Mass.400.435
SMILESCOc1cc(Nc2nc(NCC(C)(C)N)n3cnnc3c2C(N)=O)cc(OC)c1