Reaction Details
TargetPoly [ADP-ribose] polymerase 1
LigandBDBM50251548
Substrate/Competitorn/a
Meas. Tech.ChEMBL_488104 (CHEMBL986586)
Ki 33±n/a nM
Citation Zhu, GDGandhi, VBGong, JThomas, SLuo, YLiu, XShi, YKlinghofer, VJohnson, EFFrost, DDonawho, CJarvis, KBouska, JMarsh, KCRosenberg, SHGiranda, VLPenning, TD Synthesis and SAR of novel, potent and orally bioavailable benzimidazole inhibitors of poly(ADP-ribose) polymerase (PARP) with a quaternary methylene-amino substituent. Bioorg Med Chem Lett18:3955-8 (2008) 
 
Poly [ADP-ribose] polymerase 1
Name:Poly [ADP-ribose] polymerase 1
Type:n/a
Mol. Mass.:113114.22
Organism:Homo sapiens (Human)
Description:P09874
Residue:1014
BDBM50251548
NameBDBM50251548
Synonyms:2-(1-(cyclopentylamino)ethyl)-1H-benzo[d]imidazole-4-carboxamide | CHEMBL517373
TypeSmall organic molecule
Emp. Form.C15H20N4O
Mol. Mass.272.3455
SMILESCC(NC1CCCC1)c1nc2cccc(C(N)=O)c2[nH]1