Reaction Details
TargetPoly [ADP-ribose] polymerase 1
LigandBDBM50251622
Substrate/Competitorn/a
Meas. Tech.ChEMBL_488104 (CHEMBL986586)
Ki 9±n/a nM
Citation Zhu, GDGandhi, VBGong, JThomas, SLuo, YLiu, XShi, YKlinghofer, VJohnson, EFFrost, DDonawho, CJarvis, KBouska, JMarsh, KCRosenberg, SHGiranda, VLPenning, TD Synthesis and SAR of novel, potent and orally bioavailable benzimidazole inhibitors of poly(ADP-ribose) polymerase (PARP) with a quaternary methylene-amino substituent. Bioorg Med Chem Lett18:3955-8 (2008) 
 
Poly [ADP-ribose] polymerase 1
Name:Poly [ADP-ribose] polymerase 1
Type:n/a
Mol. Mass.:113114.22
Organism:Homo sapiens (Human)
Description:P09874
Residue:1014
BDBM50251622
NameBDBM50251622
Synonyms:2-(2-(cyclopentylamino)propan-2-yl)-1H-benzo[d]imidazole-4-carboxamide | CHEMBL479780
TypeSmall organic molecule
Emp. Form.C16H22N4O
Mol. Mass.286.3721
SMILESCC(C)(NC1CCCC1)c1nc2cccc(C(N)=O)c2[nH]1