Reaction Details
TargetC5a anaphylatoxin chemotactic receptor 1
LigandBDBM50251636
Substrate/Competitorn/a
Meas. Tech.ChEMBL_488511 (CHEMBL991044)
IC50>10000±n/a nM
Citation Gong, YBarbay, JKBuntinx, MLi, JWauwe, JVClaes, CLommen, GVHornby, PJHe, W Design and optimization of aniline-substituted tetrahydroquinoline C5a receptor antagonists. Bioorg Med Chem Lett18:3852-5 (2008) 
 
C5a anaphylatoxin chemotactic receptor 1
Name:C5a anaphylatoxin chemotactic receptor 1
Type:Enzyme
Mol. Mass.:39347.68
Organism:Homo sapiens (Human)
Description:P21730
Residue:350
BDBM50251636
NameBDBM50251636
Synonyms:(+/-)-2-(2,6-dimethylphenyl)-4-methoxy-N-(3-methoxy-2-methylphenyl)-N-methyl-5,6,7,8-tetrahydroquinolin-5-amine | CHEMBL480319
TypeSmall organic molecule
Emp. Form.C27H32N2O2
Mol. Mass.416.5552
SMILESCOc1cccc(N(C)C2CCCc3nc(cc(OC)c23)-c2c(C)cccc2C)c1C