Reaction Details
TargetC5a anaphylatoxin chemotactic receptor 1
LigandBDBM50251783
Substrate/Competitorn/a
Meas. Tech.ChEMBL_488511 (CHEMBL991044)
IC50 380±n/a nM
Citation Gong, YBarbay, JKBuntinx, MLi, JWauwe, JVClaes, CLommen, GVHornby, PJHe, W Design and optimization of aniline-substituted tetrahydroquinoline C5a receptor antagonists. Bioorg Med Chem Lett18:3852-5 (2008) 
 
C5a anaphylatoxin chemotactic receptor 1
Name:C5a anaphylatoxin chemotactic receptor 1
Type:Enzyme
Mol. Mass.:39347.68
Organism:Homo sapiens (Human)
Description:P21730
Residue:350
BDBM50251783
NameBDBM50251783
Synonyms:CHEMBL518297 | N-(2-chloro-5-methoxyphenyl)-2-(2,6-diethylphenyl)-4-methoxy-5,6,7,8-tetrahydroquinolin-5-amine
TypeSmall organic molecule
Emp. Form.C27H31ClN2O2
Mol. Mass.451
SMILESCCc1cccc(CC)c1-c1cc(OC)c2C(CCCc2n1)Nc1cc(OC)ccc1Cl