Reaction Details
TargetC5a anaphylatoxin chemotactic receptor 1
LigandBDBM50251845
Substrate/Competitorn/a
Meas. Tech.ChEMBL_488511 (CHEMBL991044)
IC50>10000±n/a nM
Citation Gong, YBarbay, JKBuntinx, MLi, JWauwe, JVClaes, CLommen, GVHornby, PJHe, W Design and optimization of aniline-substituted tetrahydroquinoline C5a receptor antagonists. Bioorg Med Chem Lett18:3852-5 (2008) 
 
C5a anaphylatoxin chemotactic receptor 1
Name:C5a anaphylatoxin chemotactic receptor 1
Type:Enzyme
Mol. Mass.:39347.68
Organism:Homo sapiens (Human)
Description:P21730
Residue:350
BDBM50251845
NameBDBM50251845
Synonyms:2-(2,6-diethylphenyl)-4-methoxy-N-(2-(trifluoromethyl)phenyl)-5,6,7,8-tetrahydroquinolin-5-amine | CHEMBL481755
TypeSmall organic molecule
Emp. Form.C27H29F3N2O
Mol. Mass.454.5272
SMILESCCc1cccc(CC)c1-c1cc(OC)c2C(CCCc2n1)Nc1ccccc1C(F)(F)F