Reaction Details
TargetD(4) dopamine receptor
LigandBDBM50002334
Substrate/Competitorn/a
Meas. Tech.ChEMBL_490808 (CHEMBL992745)
Ki 6.53±n/a nM
Citation Ablordeppey, SYAltundas, RBricker, BZhu, XYKumar, EVJackson, TKhan, ARoth, BL Identification of a butyrophenone analog as a potential atypical antipsychotic agent: 4-[4-(4-chlorophenyl)-1,4-diazepan-1-yl]-1-(4-fluorophenyl)butan-1-one. Bioorg Med Chem16:7291-301 (2008) 
 
D(4) dopamine receptor
Name:D(4) dopamine receptor
Type:Enzyme
Mol. Mass.:48373.19
Organism:Homo sapiens (Human)
Description:P21917
Residue:419
BDBM50002334
NameBDBM50002334
Synonyms:1-(4-Fluoro-phenyl)-4-(4-pyrimidin-2-yl-piperazin-1-yl)-butan-1-one CHEMBL140872
TypeSmall organic molecule
Emp. Form.C18H21FN4O
Mol. Mass.328.3839
SMILESFc1ccc(cc1)C(=O)CCCN1CCN(CC1)c1ncccn1