Reaction Details
TargetD(4) dopamine receptor
LigandBDBM50155520
Substrate/Competitorn/a
Meas. Tech.ChEMBL_490808 (CHEMBL992745)
Ki 17.5±n/a nM
Citation Ablordeppey, SYAltundas, RBricker, BZhu, XYKumar, EVJackson, TKhan, ARoth, BL Identification of a butyrophenone analog as a potential atypical antipsychotic agent: 4-[4-(4-chlorophenyl)-1,4-diazepan-1-yl]-1-(4-fluorophenyl)butan-1-one. Bioorg Med Chem16:7291-301 (2008) 
 
D(4) dopamine receptor
Name:D(4) dopamine receptor
Type:Enzyme
Mol. Mass.:48373.19
Organism:Homo sapiens (Human)
Description:P21917
Residue:419
BDBM50155520
NameBDBM50155520
Synonyms:4-[4-(4-Chloro-phenyl)-piperazin-1-yl]-1-(4-fluoro-phenyl)-butan-1-one; hydrochloride CHEMBL558392
TypeSmall organic molecule
Emp. Form.C20H22ClFN2O
Mol. Mass.360.853
SMILESFc1ccc(cc1)C(=O)CCCN1CCN(CC1)c1ccc(Cl)cc1