Reaction Details
Target5-hydroxytryptamine receptor 1A
LigandBDBM50262787
Substrate/Competitorn/a
Meas. Tech.ChEMBL_491031 (CHEMBL982079)
Ki 0.27±n/a nM
Citation Siracusa, MASalerno, LModica, MNPittalà, VRomeo, GAmato, MENowak, MBojarski, AJMereghetti, ICagnotto, AMennini, T Synthesis of new arylpiperazinylalkylthiobenzimidazole, benzothiazole, or benzoxazole derivatives as potent and selective 5-HT1A serotonin receptor ligands. J Med Chem51:4529-38 (2008) 
 
5-hydroxytryptamine receptor 1A
Name:5-hydroxytryptamine receptor 1A
Type:G Protein-Coupled Receptor (GPCR)
Mol. Mass.:46445.29
Organism:Rattus norvegicus (rat)
Description:Binding assays were performed using rat hippocampal membranes.
Residue:422
BDBM50262787
NameBDBM50262787
Synonyms:2-[[4-[4-(2-Methoxyphenyl)-1-piperazinyl]butyl]thio]benzothiazole | CHEMBL477765
TypeSmall organic molecule
Emp. Form.C22H27N3OS2
Mol. Mass.413.599
SMILESCOc1ccccc1N1CCN(CCCCSc2nc3ccccc3s2)CC1