Reaction Details
Target5-hydroxytryptamine receptor 1A
LigandBDBM50262746
Substrate/Competitorn/a
Meas. Tech.ChEMBL_491031 (CHEMBL982079)
Ki 0.88±n/a nM
Citation Siracusa, MASalerno, LModica, MNPittalà, VRomeo, GAmato, MENowak, MBojarski, AJMereghetti, ICagnotto, AMennini, T Synthesis of new arylpiperazinylalkylthiobenzimidazole, benzothiazole, or benzoxazole derivatives as potent and selective 5-HT1A serotonin receptor ligands. J Med Chem51:4529-38 (2008) 
 
5-hydroxytryptamine receptor 1A
Name:5-hydroxytryptamine receptor 1A
Type:G Protein-Coupled Receptor (GPCR)
Mol. Mass.:46445.29
Organism:Rattus norvegicus (rat)
Description:Binding assays were performed using rat hippocampal membranes.
Residue:422
BDBM50262746
NameBDBM50262746
Synonyms:5-Chloro-2-[[3-[4-(2-methoxyphenyl)-1-piperazinyl]propyl]thio]benzoxazole | CHEMBL478394
TypeSmall organic molecule
Emp. Form.C21H24ClN3O2S
Mol. Mass.417.952
SMILESCOc1ccccc1N1CCN(CCCSc2nc3cc(Cl)ccc3o2)CC1