Reaction Details
TargetProtein kinase C theta type
LigandBDBM50263301
Substrate/Competitorn/a
Meas. Tech.ChEMBL_489543 (CHEMBL986466)
IC50 100±n/a nM
Citation Nathan Tumey, LBoschelli, DHLee, JChaudhary, D 2-Alkenylthieno[2,3-b]pyridine-5-carbonitriles: Potent and selective inhibitors of PKCtheta. Bioorg Med Chem Lett18:4420-3 (2008) 
 
Protein kinase C theta type
Name:Protein kinase C theta type
Type:Serine/threonine-protein kinase
Mol. Mass.:81878.04
Organism:Homo sapiens (Human)
Description:Full-length human PKC theta (Panvera Catalog No. P2996).
Residue:706
BDBM50263301
NameBDBM50263301
Synonyms:3-(5-cyano-4-(4-methyl-1H-indol-5-ylamino)thieno[2,3-b]pyridin-2-yl)-N',N'-dimethylacrylohydrazide | CHEMBL515166
TypeSmall organic molecule
Emp. Form.C22H20N6OS
Mol. Mass.416.499
SMILESCN(C)NC(=O)\C=C\c1cc2c(Nc3ccc4[nH]ccc4c3C)c(cnc2s1)C#N