Reaction Details
TargetProtein kinase C delta type
LigandBDBM50263133
Substrate/Competitorn/a
Meas. Tech.ChEMBL_489544 (CHEMBL986467)
IC50 450±n/a nM
Citation Nathan Tumey, LBoschelli, DHLee, JChaudhary, D 2-Alkenylthieno[2,3-b]pyridine-5-carbonitriles: Potent and selective inhibitors of PKCtheta. Bioorg Med Chem Lett18:4420-3 (2008) 
 
Protein kinase C delta type
Name:Protein kinase C delta type
Type:Enzyme
Mol. Mass.:77516.79
Organism:Homo sapiens (Human)
Description:The recombinant human PKC enzymes were produced using a baculovirus expression system in SF9 cells
Residue:676
BDBM50263133
NameBDBM50263133
Synonyms:2-(3-(3-hydroxypyrrolidin-1-yl)-3-oxoprop-1-enyl)-4-(4-methyl-1H-indol-5-ylamino)thieno[2,3-b]pyridine-5-carbonitrile | CHEMBL477818
TypeSmall organic molecule
Emp. Form.C24H21N5O2S
Mol. Mass.443.521
SMILESCc1c(Nc2c(cnc3sc(\C=C\C(=O)N4CCC(O)C4)cc23)C#N)ccc2[nH]ccc12