Reaction Details
TargetCalmodulin-sensitive adenylate cyclase
LigandBDBM50262711
Substrate/Competitorn/a
Meas. Tech.ChEMBL_489980 (CHEMBL983795)
IC50 8498±n/a nM
Citation Chen, DMisra, MSower, LPeterson, JWKellogg, GESchein, CH Novel inhibitors of anthrax edema factor. Bioorg Med Chem16:7225-33 (2008) 
 
Calmodulin-sensitive adenylate cyclase
Name:Calmodulin-sensitive adenylate cyclase
Type:PROTEIN
Mol. Mass.:92481.33
Organism:Bacillus anthracis
Description:ChEMBL_606615
Residue:800
BDBM50262711
NameBDBM50262711
Synonyms:4-[(anthracen-9-ylmethylene)-amino]-2-hydroxy-benzoic acid | CHEMBL478182
TypeSmall organic molecule
Emp. Form.C22H15NO3
Mol. Mass.341.3594
SMILESOC(=O)c1ccc(cc1O)\N=C\c1c2ccccc2cc2ccccc12