Reaction Details
TargetVoltage-dependent T-type calcium channel subunit alpha-1G
LigandBDBM50262085
Substrate/Competitorn/a
Meas. Tech.ChEMBL_513517 (CHEMBL978139)
IC50 8.17±n/a nM
Citation Lee, HKLee, YSRoh, EJRhim, HLee, JYShin, KJ Synthesis and evaluation of alpha,alpha'-disubstituted phenylacetate derivatives for T-type calcium channel blockers. Bioorg Med Chem Lett18:4424-7 (2008) 
 
Voltage-dependent T-type calcium channel subunit alpha-1G
Name:Voltage-dependent T-type calcium channel subunit alpha-1G
Type:PROTEIN
Mol. Mass.:262471.14
Organism:Homo sapiens (Human)
Description:ChEMBL_1515216
Residue:2377
BDBM50262085
NameBDBM50262085
Synonyms:CHEMBL468397 | methyl 5-((3-(1H-benzo[d]imidazol-2-yl)propyl)(methyl)amino)-2-(4-bromophenyl)-2-isopropylpentanoate
TypeSmall organic molecule
Emp. Form.C26H34BrN3O2
Mol. Mass.500.471
SMILESCOC(=O)C(CCCN(C)CCCc1nc2ccccc2[nH]1)(C(C)C)c1ccc(Br)cc1