Reaction Details
TargetSodium-dependent serotonin transporter
LigandBDBM50262466
Substrate/Competitorn/a
Meas. Tech.ChEMBL_513531 (CHEMBL978153)
IC50 5±n/a nM
Citation Wakenhut, FFish, PVFray, MJGurrell, IMills, JEStobie, AWhitlock, GA N-Benzyl-N-(pyrrolidin-3-yl)carboxamides as a new class of selective dual serotonin/noradrenaline reuptake inhibitors. Bioorg Med Chem Lett18:4308-11 (2008) 
 
Sodium-dependent serotonin transporter
Name:Sodium-dependent serotonin transporter
Type:Multi-pass membrane protein
Mol. Mass.:70322.51
Organism:Homo sapiens (Human)
Description:P31645
Residue:630
BDBM50262466
NameBDBM50262466
Synonyms:(S)-N-(2,3,4-trichlorobenzyl)-N-(pyrrolidin-3-yl)isobutyramide | CHEMBL477374
TypeSmall organic molecule
Emp. Form.C15H19Cl3N2O
Mol. Mass.349.683
SMILESCC(C)C(=O)N(Cc1ccc(Cl)c(Cl)c1Cl)[C@H]1CCNC1