Reaction Details
TargetSodium-dependent serotonin transporter
LigandBDBM50262412
Substrate/Competitorn/a
Meas. Tech.ChEMBL_513531 (CHEMBL978153)
IC50 17±n/a nM
Citation Wakenhut, FFish, PVFray, MJGurrell, IMills, JEStobie, AWhitlock, GA N-Benzyl-N-(pyrrolidin-3-yl)carboxamides as a new class of selective dual serotonin/noradrenaline reuptake inhibitors. Bioorg Med Chem Lett18:4308-11 (2008) 
 
Sodium-dependent serotonin transporter
Name:Sodium-dependent serotonin transporter
Type:Multi-pass membrane protein
Mol. Mass.:70322.51
Organism:Homo sapiens (Human)
Description:P31645
Residue:630
BDBM50262412
NameBDBM50262412
Synonyms:(S)-N-(2,3-dichlorobenzyl)-3-methyl-N-(pyrrolidin-3-yl)butanamide | CHEMBL448900
TypeSmall organic molecule
Emp. Form.C16H22Cl2N2O
Mol. Mass.329.265
SMILESCC(C)CC(=O)N(Cc1cccc(Cl)c1Cl)[C@H]1CCNC1