Reaction Details
TargetSodium-dependent noradrenaline transporter
LigandBDBM50262415
Substrate/Competitorn/a
Meas. Tech.ChEMBL_513532 (CHEMBL979028)
IC50 14±n/a nM
Citation Wakenhut, FFish, PVFray, MJGurrell, IMills, JEStobie, AWhitlock, GA N-Benzyl-N-(pyrrolidin-3-yl)carboxamides as a new class of selective dual serotonin/noradrenaline reuptake inhibitors. Bioorg Med Chem Lett18:4308-11 (2008) 
 
Sodium-dependent noradrenaline transporter
Name:Sodium-dependent noradrenaline transporter
Type:Multi-pass membrane protein
Mol. Mass.:69337.72
Organism:Homo sapiens (Human)
Description:P23975
Residue:617
BDBM50262415
NameBDBM50262415
Synonyms:(S)-N-(biphenyl-2-ylmethyl)-N-(pyrrolidin-3-yl)isobutyramide N-Biphenyl-2-ylmethyl-N-(S)-pyrrolidin-3-yl-isobutyramide
TypeSmall organic molecule
Emp. Form.C21H26N2O
Mol. Mass.322.4439
SMILESCC(C)C(=O)N(Cc1ccccc1-c1ccccc1)[C@H]1CCNC1