Reaction Details
TargetNeutral cholesterol ester hydrolase 1
LigandBDBM50204512
Substrate/Competitorn/a
Meas. Tech.ChEMBL_557654 (CHEMBL961604)
IC50>100000±n/a nM
Citation DeMartino, JKGarfunkle, JHochstatter, DGCravatt, BFBoger, DL Exploration of a fundamental substituent effect of alpha-ketoheterocycle enzyme inhibitors: Potent and selective inhibitors of fatty acid amide hydrolase. Bioorg Med Chem Lett18:5842-6 (2008) 
 
Neutral cholesterol ester hydrolase 1
Name:Neutral cholesterol ester hydrolase 1
Type:PROTEIN
Mol. Mass.:45810.81
Organism:Homo sapiens (Human)
Description:ChEMBL_835312
Residue:408
BDBM50204512
NameBDBM50204512
Synonyms:2-(7-phenylheptanoyl)oxazole-5-carbonitrile | CHEMBL220770
TypeSmall organic molecule
Emp. Form.C17H18N2O2
Mol. Mass.282.337
SMILESO=C(CCCCCCc1ccccc1)c1ncc(o1)C#N