Reaction Details
TargetFatty-acid amide hydrolase 1 [30-579]
LigandBDBM23120
Substrate/Competitorn/a
Meas. Tech.ChEMBL_557653 (CHEMBL961603)
Ki 4.7±n/a nM
Citation DeMartino, JKGarfunkle, JHochstatter, DGCravatt, BFBoger, DL Exploration of a fundamental substituent effect of alpha-ketoheterocycle enzyme inhibitors: Potent and selective inhibitors of fatty acid amide hydrolase. Bioorg Med Chem Lett18:5842-6 (2008) 
 
Fatty-acid amide hydrolase 1 [30-579]
Name:Fatty-acid amide hydrolase 1 [30-579]
Type:Single-pass membrane protein; homodimer
Mol. Mass.:60474.00
Organism:Rattus norvegicus (rat)
Description:P97612 (aa 30-579)
Residue:550
BDBM23120
NameBDBM23120
Synonyms:7-phenyl-1-[5-(pyridin-2-yl)-1,3-oxazol-2-yl]heptan-1-one OL-135
TypeSmall organic molecule
Emp. Form.C21H22N2O2
Mol. Mass.334.4116
SMILESO=C(CCCCCCc1ccccc1)c1ncc(o1)-c1ccccn1