Reaction Details
TargetOxytocin receptor
LigandBDBM50262273
Substrate/Competitorn/a
Meas. Tech.ChEMBL_513959 (CHEMBL974600)
Ki 537±n/a nM
Citation Brown, ABrown, LEllis, DPuhalo, NSmith, CRWallace, OWatson, L Design and optimization of potent, selective antagonists of Oxytocin. Bioorg Med Chem Lett18:4278-81 (2008) 
 
Oxytocin receptor
Name:Oxytocin receptor
Type:Enzyme Catalytic Domain
Mol. Mass.:42793.26
Organism:Homo sapiens (Human)
Description:Oxytocin OXTR HEK293::B2R9L7
Residue:389
BDBM50262273
NameBDBM50262273
Synonyms:2-(4-methoxy-3-methylphenyl)-5-(5-(methoxymethyl)-4-(6-methoxypyridin-3-yl)-4H-1,2,4-triazol-3-yl)pyrazine | CHEMBL511917
TypeSmall organic molecule
Emp. Form.C22H22N6O3
Mol. Mass.418.4485
SMILESCOCc1nnc(-c2cnc(cn2)-c2ccc(OC)c(C)c2)n1-c1ccc(OC)nc1