Reaction Details
TargetOxytocin receptor
LigandBDBM50262208
Substrate/Competitorn/a
Meas. Tech.ChEMBL_513959 (CHEMBL974600)
Ki 43±n/a nM
Citation Brown, ABrown, LEllis, DPuhalo, NSmith, CRWallace, OWatson, L Design and optimization of potent, selective antagonists of Oxytocin. Bioorg Med Chem Lett18:4278-81 (2008) 
 
Oxytocin receptor
Name:Oxytocin receptor
Type:Enzyme Catalytic Domain
Mol. Mass.:42793.26
Organism:Homo sapiens (Human)
Description:Oxytocin OXTR HEK293::B2R9L7
Residue:389
BDBM50262208
NameBDBM50262208
Synonyms:2-(5-(methoxymethyl)-4-(6-methoxypyridin-3-yl)-4H-1,2,4-triazol-3-yl)-5-phenylpyrazine | CHEMBL512257
TypeSmall organic molecule
Emp. Form.C20H18N6O2
Mol. Mass.374.3959
SMILESCOCc1nnc(-c2cnc(cn2)-c2ccccc2)n1-c1ccc(OC)nc1