Reaction Details
TargetOxytocin receptor
LigandBDBM50262206
Substrate/Competitorn/a
Meas. Tech.ChEMBL_513959 (CHEMBL974600)
Ki 56±n/a nM
Citation Brown, ABrown, LEllis, DPuhalo, NSmith, CRWallace, OWatson, L Design and optimization of potent, selective antagonists of Oxytocin. Bioorg Med Chem Lett18:4278-81 (2008) 
 
Oxytocin receptor
Name:Oxytocin receptor
Type:Enzyme Catalytic Domain
Mol. Mass.:42793.26
Organism:Homo sapiens (Human)
Description:Oxytocin OXTR HEK293::B2R9L7
Residue:389
BDBM50262206
NameBDBM50262206
Synonyms:3-(2'-Methoxy-biphenyl-4-yl)-4-(4-methoxy-phenyl)-5-methyl-4H-[1,2,4]triazole | CHEMBL467184
TypeSmall organic molecule
Emp. Form.C23H21N3O2
Mol. Mass.371.4317
SMILESCOc1ccc(cc1)-n1c(C)nnc1-c1ccc(cc1)-c1ccccc1OC