Reaction Details
TargetVasopressin V1a receptor
LigandBDBM50262328
Substrate/Competitorn/a
Meas. Tech.ChEMBL_513958 (CHEMBL974599)
Ki 432±n/a nM
Citation Brown, ABrown, LEllis, DPuhalo, NSmith, CRWallace, OWatson, L Design and optimization of potent, selective antagonists of Oxytocin. Bioorg Med Chem Lett18:4278-81 (2008) 
 
Vasopressin V1a receptor
Name:Vasopressin V1a receptor
Type:Receptor
Mol. Mass.:46820.18
Organism:Homo sapiens (Human)
Description:P37288
Residue:418
BDBM50262328
NameBDBM50262328
Synonyms:2-(3,4-dimethylphenyl)-5-(5-(methoxymethyl)-4-(6-methoxypyridin-3-yl)-4H-1,2,4-triazol-3-yl)pyrazine | CHEMBL511215
TypeSmall organic molecule
Emp. Form.C22H22N6O2
Mol. Mass.402.4491
SMILESCOCc1nnc(-c2cnc(cn2)-c2ccc(C)c(C)c2)n1-c1ccc(OC)nc1