Reaction Details
TargetGlutamate racemase
LigandBDBM50261911
Substrate/Competitorn/a
Meas. Tech.ChEMBL_514356 (CHEMBL967970)
IC50 59±n/a nM
Citation Basarab, GSHill, PJRastagar, AWebborn, PJ Design of Helicobacter pylori glutamate racemase inhibitors as selective antibacterial agents: a novel pro-drug approach to increase exposure. Bioorg Med Chem Lett18:4716-22 (2008) 
 
Glutamate racemase
Name:Glutamate racemase
Type:PROTEIN
Mol. Mass.:28413.39
Organism:Helicobacter pylori
Description:ChEMBL_475324
Residue:255
BDBM50261911
NameBDBM50261911
Synonyms:3-(3-chloro-5-(methylsulfonyl)furan-2-yl)-2-((6-chloroquinolin-4-yl)methyl)-7-(cyclopropylmethyl)-5-methyl-2H-pyrazolo[3,4-d]pyrimidine-4,6(5H,7H)-dione | CHEMBL469007
TypeSmall organic molecule
Emp. Form.C25H21Cl2N5O5S
Mol. Mass.574.436
SMILESCn1c(=O)n(CC2CC2)c2nn(Cc3ccnc4ccc(Cl)cc34)c(-c3oc(cc3Cl)S(C)(=O)=O)c2c1=O