Reaction Details
TargetGlutamate racemase
LigandBDBM50262115
Substrate/Competitorn/a
Meas. Tech.ChEMBL_514356 (CHEMBL967970)
IC50 26±n/a nM
Citation Basarab, GSHill, PJRastagar, AWebborn, PJ Design of Helicobacter pylori glutamate racemase inhibitors as selective antibacterial agents: a novel pro-drug approach to increase exposure. Bioorg Med Chem Lett18:4716-22 (2008) 
 
Glutamate racemase
Name:Glutamate racemase
Type:PROTEIN
Mol. Mass.:28413.39
Organism:Helicobacter pylori
Description:ChEMBL_475324
Residue:255
BDBM50262115
NameBDBM50262115
Synonyms:2-((5-chloro-1H-indol-3-yl)methyl)-7-(cyclopropylmethyl)-5-methyl-3-(1-methyl-4-(methylsulfonyl)-1H-pyrrol-2-yl)-2H-pyrazolo[3,4-d]pyrimidine-4,6(5H,7H)-dione | CHEMBL469231
TypeSmall organic molecule
Emp. Form.C25H25ClN6O4S
Mol. Mass.541.022
SMILESCn1cc(cc1-c1n(Cc2c[nH]c3ccc(Cl)cc23)nc2n(CC3CC3)c(=O)n(C)c(=O)c12)S(C)(=O)=O