Reaction Details
TargetGlutamate racemase
LigandBDBM50262114
Substrate/Competitorn/a
Meas. Tech.ChEMBL_514356 (CHEMBL967970)
IC50 34±n/a nM
Citation Basarab, GSHill, PJRastagar, AWebborn, PJ Design of Helicobacter pylori glutamate racemase inhibitors as selective antibacterial agents: a novel pro-drug approach to increase exposure. Bioorg Med Chem Lett18:4716-22 (2008) 
 
Glutamate racemase
Name:Glutamate racemase
Type:PROTEIN
Mol. Mass.:28413.39
Organism:Helicobacter pylori
Description:ChEMBL_475324
Residue:255
BDBM50262114
NameBDBM50262114
Synonyms:2-((6-chloroquinolin-4-yl)methyl)-7-(cyclopropylmethyl)-5-methyl-3-(1-methyl-4-(methylsulfonyl)-1H-pyrrol-2-yl)-2H-pyrazolo[3,4-d]pyrimidine-4,6(5H,7H)-dione | CHEMBL469230
TypeSmall organic molecule
Emp. Form.C26H25ClN6O4S
Mol. Mass.553.033
SMILESCn1cc(cc1-c1n(Cc2ccnc3ccc(Cl)cc23)nc2n(CC3CC3)c(=O)n(C)c(=O)c12)S(C)(=O)=O