Reaction Details
TargetGlutamate racemase
LigandBDBM50261966
Substrate/Competitorn/a
Meas. Tech.ChEMBL_514356 (CHEMBL967970)
IC50 44±n/a nM
Citation Basarab, GSHill, PJRastagar, AWebborn, PJ Design of Helicobacter pylori glutamate racemase inhibitors as selective antibacterial agents: a novel pro-drug approach to increase exposure. Bioorg Med Chem Lett18:4716-22 (2008) 
 
Glutamate racemase
Name:Glutamate racemase
Type:PROTEIN
Mol. Mass.:28413.39
Organism:Helicobacter pylori
Description:ChEMBL_475324
Residue:255
BDBM50261966
NameBDBM50261966
Synonyms:5-(2-((6-chloroquinolin-4-yl)methyl)-7-(cyclopropylmethyl)-5-methyl-4,6-dioxo-4,5,6,7-tetrahydro-2H-pyrazolo[3,4-d]pyrimidin-3-yl)-N,1-dimethyl-1H-pyrrole-3-sulfonamide | CHEMBL513864
TypeSmall organic molecule
Emp. Form.C26H26ClN7O4S
Mol. Mass.568.047
SMILESCNS(=O)(=O)c1cc(-c2n(Cc3ccnc4ccc(Cl)cc34)nc3n(CC4CC4)c(=O)n(C)c(=O)c23)n(C)c1