Reaction Details
TargetAromatase
LigandBDBM50262165
Substrate/Competitorn/a
Meas. Tech.ChEMBL_514373 (CHEMBL967987)
IC50 93.8±n/a nM
Citation Lézé, MPPalusczak, AHartmann, RWLe Borgne, M Synthesis of 6- or 4-functionalized indoles via a reductive cyclization approach and evaluation as aromatase inhibitors. Bioorg Med Chem Lett18:4713-5 (2008) 
 
Aromatase
Name:Aromatase
Type:Enzyme
Mol. Mass.:57888.92
Organism:Homo sapiens (Human)
Description:P11511
Residue:503
BDBM50262165
NameBDBM50262165
Synonyms:4-[(1H-indol-6-yl)(1H-1,2,4-triazol-1-yl)methyl]benzonitrile | CHEMBL512994
TypeSmall organic molecule
Emp. Form.C18H13N5
Mol. Mass.299.3293
SMILESN#Cc1ccc(cc1)C(c1ccc2cc[nH]c2c1)n1cncn1