Reaction Details
TargetNeuronal acetylcholine receptor subunit alpha-4
LigandBDBM50261763
Substrate/Competitorn/a
Meas. Tech.ChEMBL_509574 (CHEMBL1000460)
Ki 70±n/a nM
Citation Rizzi, LDallanoce, CMatera, CMagrone, PPucci, LGotti, CClementi, FDe Amici, M Epiboxidine and novel-related analogues: a convenient synthetic approach and estimation of their affinity at neuronal nicotinic acetylcholine receptor subtypes. Bioorg Med Chem Lett18:4651-4 (2008) 
 
Neuronal acetylcholine receptor subunit alpha-4
Name:Neuronal acetylcholine receptor subunit alpha-4
Type:Enzyme
Mol. Mass.:70196.44
Organism:Rattus norvegicus (Rat)
Description:P09483
Residue:630
BDBM50261763
NameBDBM50261763
Synonyms:(+/-)-endo-(1R,2R,4R)-2-(3-methylisoxazol-5-yl)-7-aza-bicyclo[2.2.1]heptane | CHEMBL504313
TypeSmall organic molecule
Emp. Form.C10H14N2O
Mol. Mass.178.231
SMILESCc1cc(on1)[C@@H]1C[C@H]2CC[C@H]1N2