Reaction Details
TargetFatty-acid amide hydrolase 1
LigandBDBM50161512
Substrate/Competitorn/a
Meas. Tech.ChEMBL_557657 (CHEMBL961607)
pH9±n/a
Ki 0.29±n/a nM
Commentsextracted
Citation Slaymaker, IMBracey, MMileni, MGarfunkle, JCravatt, BFBoger, DLStevens, RC Correlation of inhibitor effects on enzyme activity and thermal stability for the integral membrane protein fatty acid amide hydrolase. Bioorg Med Chem Lett18:5847-50 (2008) 
 
Fatty-acid amide hydrolase 1
Name:Fatty-acid amide hydrolase 1
Type:Protein
Mol. Mass.:63071.19
Organism:Homo sapiens (Human)
Description:O00519
Residue:579
BDBM50161512
NameBDBM50161512
Synonyms:7-Phenyl-1-(5-(pyridin-2-yl)-1,3,4-oxadiazol-2-yl)-heptan-1-one 7-phenyl-1-(5-(pyridin-2-yl)-1,3,4-oxadiazol-2-yl)heptan-1-one | CHEMBL178398
TypeSmall organic molecule
Emp. Form.C20H21N3O2
Mol. Mass.335.3996
SMILESO=C(CCCCCCc1ccccc1)c1nnc(o1)-c1ccccn1