Reaction Details
TargetLuciferin 4-monooxygenase
LigandBDBM50272796
Substrate/Competitorn/a
Meas. Tech.ChEMBL_509645 (CHEMBL1003973)
IC50 160±n/a nM
Citation Heitman, LHvan Veldhoven, JPZweemer, AMYe, KBrussee, JIJzerman, AP False positives in a reporter gene assay: identification and synthesis of substituted N-pyridin-2-ylbenzamides as competitive inhibitors of firefly luciferase. J Med Chem51:4724-9 (2008) 
 
Luciferin 4-monooxygenase
Name:Luciferin 4-monooxygenase
Type:PROTEIN
Mol. Mass.:60126.66
Organism:Luciola lateralis
Description:ChEMBL_786225
Residue:548
BDBM50272796
NameBDBM50272796
Synonyms:3-Chloro-N-(5-phenylpyridin-2-yl)benzamide | CHEMBL498681
TypeSmall organic molecule
Emp. Form.C18H13ClN2O
Mol. Mass.308.762
SMILESClc1cccc(c1)C(=O)Nc1ccc(cn1)-c1ccccc1