Reaction Details
TargetGamma-aminobutyric acid receptor subunit alpha-1
LigandBDBM50273004
Substrate/Competitorn/a
Meas. Tech.ChEMBL_514093 (CHEMBL967929)
EC50 9500000±n/a nM
Citation Jansen, MRabe, HStrehle, ADieler, SDebus, FDannhardt, GAkabas, MHLüddens, H Synthesis of GABAA receptor agonists and evaluation of their alpha-subunit selectivity and orientation in the GABA binding site. J Med Chem51:4430-48 (2008) 
 
Gamma-aminobutyric acid receptor subunit alpha-1
Name:Gamma-aminobutyric acid receptor subunit alpha-1
Type:Enzyme
Mol. Mass.:51770.21
Organism:Rattus norvegicus (Rat)
Description:P62813
Residue:455
BDBM50273004
NameBDBM50273004
Synonyms:5-Piperidin-4-yl-3H-[1,3,4]oxadiazol-2-thione Hydrochloride | CHEMBL456576
TypeSmall organic molecule
Emp. Form.C7H11N3OS
Mol. Mass.185.247
SMILESSc1nnc(o1)C1CCNCC1