Reaction Details
TargetGamma-aminobutyric acid receptor subunit alpha-6
LigandBDBM50273004
Substrate/Competitorn/a
Meas. Tech.ChEMBL_514066 (CHEMBL979089)
IC50 66000±n/a nM
Citation Jansen, MRabe, HStrehle, ADieler, SDebus, FDannhardt, GAkabas, MHLüddens, H Synthesis of GABAA receptor agonists and evaluation of their alpha-subunit selectivity and orientation in the GABA binding site. J Med Chem51:4430-48 (2008) 
 
Gamma-aminobutyric acid receptor subunit alpha-6
Name:Gamma-aminobutyric acid receptor subunit alpha-6
Type:Enzyme Catalytic Domain
Mol. Mass.:51188.24
Organism:RAT
Description:GABA A Alpha6Beta2Gamma2 0 RAT::P30191
Residue:453
BDBM50273004
NameBDBM50273004
Synonyms:5-Piperidin-4-yl-3H-[1,3,4]oxadiazol-2-thione Hydrochloride | CHEMBL456576
TypeSmall organic molecule
Emp. Form.C7H11N3OS
Mol. Mass.185.247
SMILESSc1nnc(o1)C1CCNCC1