Reaction Details
Target17-beta-hydroxysteroid dehydrogenase type 1
LigandBDBM50174298
Substrate/Competitorn/a
Meas. Tech.ChEMBL_514763 (CHEMBL977262)
IC50>1000±n/a nM
Citation Fotsch, CWang, M Blockade of glucocorticoid excess at the tissue level: inhibitors of 11beta-hydroxysteroid dehydrogenase type 1 as a therapy for type 2 diabetes. J Med Chem51:4851-7 (2008) 
 
17-beta-hydroxysteroid dehydrogenase type 1
Name:17-beta-hydroxysteroid dehydrogenase type 1
Type:Enzyme
Mol. Mass.:34945.13
Organism:Homo sapiens (Human)
Description:P14061
Residue:328
BDBM50174298
NameBDBM50174298
Synonyms:3-(4-(3-(4-fluorophenyl)-1,2,4-oxadiazol-5-yl)bicyclo[2.2.2]octan-1-yl)-4-methyl-5-(2-(trifluoromethyl)phenyl)-4H-1,2,4-triazole | CHEMBL373257
TypeSmall organic molecule
Emp. Form.C26H23F4N5O
Mol. Mass.497.4873
SMILESCn1c(nnc1C12CCC(CC1)(CC2)c1nc(no1)-c1ccc(F)cc1)-c1ccccc1C(F)(F)F